{"text_format":"1","workbook":"xlsx","n_sheets":25,"sheets":["General","TranslApp","Version","Distribution","Distribution (2)","DataTree","PictSelect","Settings","Log","Pattern","ItemID0","ItemID1","ItemID2","ItemID3","ItemID4","ItemID5","ItemID6","DemoArchiv","Graph2D","SchemeTree","Document","ReportResult","Output","OutputItem","Transl"],"not_rendered":{"charts":16,"images":15,"macros":1,"external_links":0,"defined_names":21,"comments":0,"pivot_tables":0},"unopened":[],"bounds":{"document_bytes":16777216,"sheet_cells":100000,"rows_first":2000,"rows_last":500,"rows_between":2000,"halvings":0,"cell_chars":16384,"cell_head_chars":4096},"cells_cut":0,"cells_raw":0,"read":"whole","date_system":"1900"}

{"sheet":"General","index":0,"n_rows":62,"n_cols":14,"rows_kept":62,"cut":false,"hidden":false,"merged":[]}
[]
[]
[null,null,null,"v. 3.1"]
[null,"PREV",null,{"$f":"IF(Settings!B48,\"bridges+\",\"\")","v":""},null,null,"Rozšířeno pro :"]
[]
[]
[null,"Modul:","Pre-Generation Simulation Pattern"]
[]
{"$rows_left_out":55}
{"sheet":"TranslApp","index":1,"n_rows":131,"n_cols":2,"rows_kept":131,"cut":false,"hidden":false,"merged":[]}
["Není vybrána žádná položka pro tuto operaci.","No selected item for this operation."]
["Opravte zadání!","Correct the input!"]
["Roky pro výběr dat nejsou správně zadány!","The years for data selection aren't correct."]
["Nelze provést generaci výpočtu pro položku na řádku: ","Cannot generate calculation for Item od row index: "]
["Nelze zobrazit list : ","Cannot show sheet : "]
["Nelze skrýt list : ","Cannot hide sheet : "]
["Smazat všechny položky na hladině : ","Delete all items on level : "]
["PREV application","PREV application"]
{"$rows_left_out":124}
{"sheet":"Version","index":2,"n_rows":42,"n_cols":22,"rows_kept":42,"cut":false,"hidden":false,"merged":[]}
[]
[null,null,null,null,null,null,null,null,null,null,null,null,null,null,null,null,null,null,null,null,null,"Další nástroj PREV vychází ze základní verze zpracované v rámci výzkumného centra CIDEAS. Jedná se o softwarovou podporu při vyhodnocování projektových řešení:"]
[null,"Verze 3.0",null,null,null,null,null,null,null,null,null,null,null,null,null,null,null,null,null,null,null," - umožňuje porovnávat alternativy řešení stejně jako různé projektové návrhy (hodnocená úloha je dekomponována na strom hodnotících kritérií),"]
[null,null," - vytvoření podpory MS Office 2007"]
[null,null," - oprava generace grafů pro MS Office 2007"]
[null,null," - doplnění posterové prezentace úlohy"]
[null,null," - grafy ve stromové struktuře projektu"]
[null,null," - lokalizace aplikace do EN jazyk",null,null,null,null,null,null,null,null,null,null,null,null,null,null,null,null,null,null," - jedná se o otevřený nástroj pro různé aplikační obory (stejně pojmenovaná kritéria je možné použít pro různé projekty),"]
{"$rows_left_out":35}
{"sheet":"Distribution","index":3,"n_rows":344,"n_cols":54,"rows_kept":344,"cut":false,"hidden":false,"merged":[]}
["Vyšší -> Lepší",1,2,3,4,5,6,7,8,9,10,null,null,"stredni hodnota","rozptyl","sikmost",1,2,3,4,5,6,7,8,9,10,null,null,"Vyšší -> Horší",{"$f":"Q1","v":1},{"$f":"R1","v":2},3,4,5,6,7,8,9,10,null,null,"stredni hodnota","rozptyl",null,10,9,8,7,6,5,4,3,2,1]
["A22",0,0,0,0,0,0,0,0.72499999999999998,0.2,7.4999999999999997E-2,{"$f":"SUM(B2:K2)","v":1},null,{"$f":"SUMPRODUCT(B2:K2,$B$1:$K$1)","v":8.35},{"$f":"SUM(Q2:Z2)","v":0.3775},null,{"$f":"B2*(B$1-$N2)^2","v":0},{"$f":"C2*(C$1-$N2)^2","v":0},0,0,0,0,0,8.8812499999999808E-2,8.4500000000000103E-2,0.20418750000000008,null,null,"A22",{"$f":"K2","v":7.4999999999999997E-2},{"$f":"J2","v":0.2},{"$f":"I2","v":0.72499999999999998},{"$f":"H2","v":0},{"$f":"G2","v":0},{"$f":"F2","v":0},{"$f":"E2","v":0},{"$f":"D2","v":0},{"$f":"C2","v":0},{"$f":"B2","v":0},{"$f":"SUM(AD2:AM2)","v":1},null,{"$f":"SUMPRODUCT(AD2:AM2,$AD$1:$AM$1)","v":2.65},{"$f":"SUM(AS2:BB2)","v":0.37749999999999995},null,{"$f":"AD2*(AD$1-$AP2)^2","v":0.20418749999999997},{"$f":"AE2*(AE$1-$AP2)^2","v":8.4499999999999978E-2},8.8812500000000044E-2,0,0,0,0,0,0,0]
["A23",0,0,0,0,0,0,0,0.625,0.24999999952571525,0.12500000047428464,0.99999999999999989,null,{"$f":"SUMPRODUCT(B3:K3,$B$1:$K$1)","v":8.5000000004742837},{"$f":"SUM(Q3:Z3)","v":0.50000000094856922},null,{"$f":"B3*(B$1-$N3)^2","v":0},{"$f":"C3*(C$1-$N3)^2","v":0},0,0,0,0,0,0.15625000029642733,6.2499999762857882E-2,0.28125000088928404,null,null,"A23",{"$f":"K3","v":0.12500000047428464},{"$f":"J3","v":0.24999999952571525},{"$f":"I3","v":0.625},{"$f":"H3","v":0},{"$f":"G3","v":0},{"$f":"F3","v":0},{"$f":"E3","v":0},{"$f":"D3","v":0},{"$f":"C3","v":0},{"$f":"B3","v":0},0.99999999999999989,null,{"$f":"SUMPRODUCT(AD3:AM3,$AD$1:$AM$1)","v":2.4999999995257154},{"$f":"SUM(AS3:BB3)","v":0.50000000094856922},null,{"$f":"AD3*(AD$1-$AP3)^2","v":0.2812500008892837},{"$f":"AE3*(AE$1-$AP3)^2","v":6.249999976285766E-2},{"$f":"AF3*(AF$1-$AP3)^2","v":0.15625000029642788},{"$f":"AG3*(AG$1-$AP3)^2","v":0},{"$f":"AH3*(AH$1-$AP3)^2","v":0},{"$f":"AI3*(AI$1-$AP3)^2","v":0},{"$f":"AJ3*(AJ$1-$AP3)^2","v":0},{"$f":"AK3*(AK$1-$AP3)^2","v":0},{"$f":"AL3*(AL$1-$AP3)^2","v":0},{"$f":"AM3*(AM$1-$AP3)^2","v":0}]
["A24",0,0,0,0,0,0,6.8930460719683123E-3,0.58364172356818911,0.30514436857574734,0.10432086178409508,0.99999999999999978,null,{"$f":"SUMPRODUCT(B4:K4,$B$1:$K$1)","v":8.5068930460719674},{"$f":"SUM(Q4:Z4)","v":0.47238030162797645},null,{"$f":"B4*(B$1-$N4)^2","v":0},0,0,0,0,0,1.5652223431150632E-2,0.14996123138409248,7.4197216607949298E-2,0.23256963020478405,null,null,"A24",0.10432086178409508,0.30514436857574734,0.58364172356818911,6.8930460719683123E-3,0,0,0,0,0,0,0.99999999999999978,null,2.4931069539280304,{"$f":"SUM(AS4:BB4)","v":0.47238030162797645},null,0.23256963020478336,7.4197216607948632E-2,0.14996123138409378,1.5652223431150677E-2,0,0,0,0,0,0]
["A25",0,0,0,0,0,0,6.25E-2,0.4375,0.4375,6.25E-2,1,null,{"$f":"SUMPRODUCT(B5:K5,$B$1:$K$1)","v":8.5},{"$f":"SUM(Q5:Z5)","v":0.5},null,{"$f":"B5*(B$1-$N5)^2","v":0},{"$f":"C5*(C$1-$N5)^2","v":0},{"$f":"D5*(D$1-$N5)^2","v":0},{"$f":"E5*(E$1-$N5)^2","v":0},{"$f":"F5*(F$1-$N5)^2","v":0},{"$f":"G5*(G$1-$N5)^2","v":0},{"$f":"H5*(H$1-$N5)^2","v":0.140625},{"$f":"I5*(I$1-$N5)^2","v":0.109375},{"$f":"J5*(J$1-$N5)^2","v":0.109375},{"$f":"K5*(K$1-$N5)^2","v":0.140625},null,null,"A25",6.25E-2,0.4375,0.4375,6.25E-2,0,0,0,0,0,0,1,null,2.5,{"$f":"SUM(AS5:BB5)","v":0.5},null,0.140625,0.109375,0.109375,0.140625,0,0,0,0,0,0]
["A26",0,0,0,0,0,0,0.10432086178409508,0.30514436857574734,0.58364172356818911,6.8930460719683123E-3,0.99999999999999978,null,8.4931069539280291,0.4723803016279764,null,0,0,0,0,0,0,0.23256963020478294,7.419721660794823E-2,0.14996123138409459,1.5652223431150705E-2,null,null,"A26",6.8930460719683123E-3,0.58364172356818911,0.30514436857574734,0.10432086178409508,0,0,0,0,0,0,0.99999999999999978,null,2.5068930460719687,0.47238030162797645,null,1.565222343115066E-2,0.14996123138409326,7.4197216607948896E-2,0.23256963020478363,0,0,0,0,0,0]
["A27",0,0,0,0,0,0,0.12500000047428464,0.24999999952571525,0.625,0,0.99999999999999989,null,8.4999999995257145,0.50000000094856922,null,0,0,0,0,0,0,0.28125000088928337,6.2499999762857437E-2,0.15625000029642844,0,null,null,"A27",0,0.625,0.24999999952571525,0.12500000047428464,0,0,0,0,0,0,0.99999999999999989,null,2.5000000004742842,0.50000000094856922,null,0,0.1562500002964276,6.2499999762857771E-2,0.28125000088928387,0,0,0,0,0,0]
["A28",0,0,0,0,0,0,7.4999999999999997E-2,0.2,0.72499999999999998,0,1,null,8.6499999999999986,0.3775,null,0,0,0,0,0,0,0.20418749999999963,8.4499999999999631E-2,8.8812500000000724E-2,0,null,null,"A28",0,0.72499999999999998,0.2,7.4999999999999997E-2,0,0,0,0,0,0,1,null,2.3499999999999996,0.3775,null,0,8.8812499999999808E-2,8.4500000000000103E-2,0.20418750000000008,0,0,0,0,0,0]
{"$rows_left_out":337}
{"sheet":"Distribution (2)","index":4,"n_rows":26,"n_cols":54,"rows_kept":26,"cut":false,"hidden":false,"merged":[]}
["Vyšší -> Lepší",1,2,3,4,5,6,7,8,9,10,null,null,"stredni hodnota","rozptyl","sikmost",1,2,3,4,5,6,7,8,9,10,null,null,"Vyšší -> Horší",{"$f":"Q1","v":1},2,3,4,5,6,7,8,9,10,null,null,"stredni hodnota","rozptyl",null,10,9,8,7,6,5,4,3,2,1]
["A22",0,0,0,0,0,0,0,0.72499999999999998,0.2,7.4999999999999997E-2,{"$f":"SUM(B2:K2)","v":1},null,{"$f":"SUMPRODUCT(B2:K2,$B$1:$K$1)","v":8.35},{"$f":"SUM(Q2:Z2)","v":0.3775},null,{"$f":"B2*(B$1-$N2)^2","v":0},0,0,0,0,0,0,8.8812499999999808E-2,8.4500000000000103E-2,0.20418750000000008,null,null,"A22",{"$f":"K2","v":7.4999999999999997E-2},{"$f":"J2","v":0.2},{"$f":"I2","v":0.72499999999999998},{"$f":"H2","v":0},{"$f":"G2","v":0},{"$f":"F2","v":0},{"$f":"E2","v":0},{"$f":"D2","v":0},{"$f":"C2","v":0},{"$f":"B2","v":0},{"$f":"SUM(AD2:AM2)","v":1},null,{"$f":"SUMPRODUCT(AD2:AM2,$AD$1:$AM$1)","v":2.65},{"$f":"SUM(AS2:BB2)","v":0.37749999999999995},null,{"$f":"AD2*(AD$1-$AP2)^2","v":0.20418749999999997},8.4499999999999978E-2,8.8812500000000044E-2,0,0,0,0,0,0,0]
["A23",0,0,0,0,0,0,0,0.625,0.24999999952571525,0.12500000047428464,0.99999999999999989,null,8.5000000004742837,0.50000000094856922,null,0,0,0,0,0,0,0,0.15625000029642733,6.2499999762857882E-2,0.28125000088928404,null,null,"A23",0.12500000047428464,0.24999999952571525,0.625,0,0,0,0,0,0,0,0.99999999999999989,null,2.4999999995257154,0.50000000094856922,null,0.2812500008892837,6.249999976285766E-2,0.15625000029642788,0,0,0,0,0,0,0]
["A24",0,0,0,0,0,0,6.8930460719683123E-3,0.58364172356818911,0.30514436857574734,0.10432086178409508,0.99999999999999978,null,8.5068930460719674,0.47238030162797645,null,0,0,0,0,0,0,1.5652223431150632E-2,0.14996123138409248,7.4197216607949298E-2,0.23256963020478405,null,null,"A24",0.10432086178409508,0.30514436857574734,0.58364172356818911,6.8930460719683123E-3,0,0,0,0,0,0,0.99999999999999978,null,2.4931069539280304,0.47238030162797645,null,0.23256963020478336,7.4197216607948632E-2,0.14996123138409378,1.5652223431150677E-2,0,0,0,0,0,0]
["A25",0,0,0,0,0,0,6.25E-2,0.4375,0.4375,6.25E-2,1,null,8.5,0.5,null,0,0,0,0,0,0,0.140625,0.109375,0.109375,0.140625,null,null,"A25",6.25E-2,0.4375,0.4375,6.25E-2,0,0,0,0,0,0,1,null,2.5,0.5,null,0.140625,0.109375,0.109375,0.140625,0,0,0,0,0,0]
["A26",0,0,0,0,0,0,0.10432086178409508,0.30514436857574734,0.58364172356818911,6.8930460719683123E-3,0.99999999999999978,null,8.4931069539280291,0.4723803016279764,null,0,0,0,0,0,0,0.23256963020478294,7.419721660794823E-2,0.14996123138409459,1.5652223431150705E-2,null,null,"A26",6.8930460719683123E-3,0.58364172356818911,0.30514436857574734,0.10432086178409508,0,0,0,0,0,0,0.99999999999999978,null,2.5068930460719687,0.47238030162797645,null,1.565222343115066E-2,0.14996123138409326,7.4197216607948896E-2,0.23256963020478363,0,0,0,0,0,0]
["A27",0,0,0,0,0,0,0.12500000047428464,0.24999999952571525,0.625,0,0.99999999999999989,null,8.4999999995257145,0.50000000094856922,null,0,0,0,0,0,0,0.28125000088928337,6.2499999762857437E-2,0.15625000029642844,0,null,null,"A27",0,0.625,0.24999999952571525,0.12500000047428464,0,0,0,0,0,0,0.99999999999999989,null,2.5000000004742842,0.50000000094856922,null,0,0.1562500002964276,6.2499999762857771E-2,0.28125000088928387,0,0,0,0,0,0]
["A28",0,0,0,0,0,0,7.4999999999999997E-2,0.2,0.72499999999999998,0,1,null,8.6499999999999986,0.3775,null,0,0,0,0,0,0,0.20418749999999963,8.4499999999999631E-2,8.8812500000000724E-2,0,null,null,"A28",0,0.72499999999999998,0.2,7.4999999999999997E-2,0,0,0,0,0,0,1,null,2.3499999999999996,0.3775,null,0,8.8812499999999808E-2,8.4500000000000103E-2,0.20418750000000008,0,0,0,0,0,0]
{"$rows_left_out":19}
{"sheet":"DataTree","index":5,"n_rows":8,"n_cols":17,"rows_kept":8,"cut":false,"hidden":false,"merged":[]}
["IndexLevel","IDItem","IDParent","Weight","Average","Risk","Title","Description","Project","Trend","RiskEval","RozptylEval","SikmostEval","Preference",null,"Minimum","Maximum"]
[0,0,-1,null,null,null,"Most SO 201 - beton",null,"Most Suchdol - beton"]
[1,1,0,0.3,0,0,"Technické řešení"]
[1,2,0,0.7,0,0,"Ekonomické řešení"]
[2,3,1,0.3,3.6,0.9,"Doba výstavby"]
[2,4,1,0.7,7.5,0.5,"Životnost"]
[2,5,2,0.5,3.92,0.3,"Pořizovací cena",null,null,0,null,null,null,null,null,120,130]
[2,6,2,0.5,2.35,0.7,"Provozní náklady /rok"]
{"$rows_left_out":1}
{"sheet":"PictSelect","index":6,"n_rows":0,"n_cols":0,"rows_kept":0,"cut":false,"hidden":false,"merged":[]}

{"sheet":"Settings","index":7,"n_rows":55,"n_cols":33,"rows_kept":55,"cut":false,"hidden":false,"merged":[]}
[null,null,null,"Selected sheets:",1,"Umístění archivu:","DemoArchiv","Calculation :",null,"Hodnocení:","A","absolutně nejlepší","Rozptyl:",2,"téměř žádný","Šikmost:",2,"velmi silně pozitivní","Předgenerace:",true]
["User ID :",0,null,null,"X2DEkoDostupnost",null,null,"Number of simulation :",100,null,"V","velmi dobré",null,3,"mírný",null,3,"velice pozitivní","Typ rozdeleni :",1]
["Authorisation :",false,null,null,null,null,null,"Number of parameterisation :",40,null,"D","dobré",null,4,"menší",null,4,"značně pozitivní","Rozdělení:","rovnoměrné"]
[null,null,null,null,null,null,null,null,null,null,"P","průměrné",null,5,"průměrný",null,5,"průměrná",null,"normální"]
["Application language:",0,null,null,null,null,null,null,null,null,"H","horší",null,6,"značný",null,6,"méně negativní",null,null,null,null,null,null,null,null,null,null,null,null,null,"Administrator","administrator"]
["Num. of application language:",2,null,null,null,null,null,null,null,null,"Z","značně horší",null,7,"velký",null,7,"mírně negativní",null,null,null,null,null,null,null,null,null,null,null,null,null,"User ŘSD1","rsd1"]
["List of application language:","czech",null,null,null,null,null,null,null,null,"S","špatné",null,8,"téměř největší",null,8,"velmi silně negativní",null,null,null,null,null,null,null,null,null,null,null,null,null,"User ŘSD2","rsd2"]
[null,"english",null,null,null,null,null,null,null,null,null,null,null,null,null,null,null,null,null,null,null,null,null,null,null,null,null,null,null,null,null,"User ŘSD3","rsd3"]
{"$rows_left_out":48}
{"sheet":"Log","index":8,"n_rows":1,"n_cols":1,"rows_kept":1,"cut":false,"hidden":false,"merged":[]}
["Nelze provést generaci výpočtu pro položku na řádku: 9"]

{"sheet":"Pattern","index":9,"n_rows":1000,"n_cols":1,"rows_kept":1000,"cut":false,"hidden":false,"merged":[]}
[0.82803447947141162]
[0.42496860884629584]
[0.48082818873931843]
[0.24725277478757146]
[0.95347071843751019]
[0.72383078543105972]
[0.33209576456424306]
[0.20610128996686328]
{"$rows_left_out":993}
{"sheet":"ItemID0","index":10,"n_rows":100,"n_cols":1,"rows_kept":100,"cut":false,"hidden":false,"merged":[]}
[{"$f":"DataTree!$D$3*ItemID1!$A$1+DataTree!$D$4*ItemID2!$A$1","v":4.6007846600834714}]
[{"$f":"DataTree!$D$3*ItemID1!$A$2+DataTree!$D$4*ItemID2!$A$2","v":3.9920895865143606}]
[{"$f":"DataTree!$D$3*ItemID1!$A$3+DataTree!$D$4*ItemID2!$A$3","v":4.067731737591803}]
[{"$f":"DataTree!$D$3*ItemID1!$A$4+DataTree!$D$4*ItemID2!$A$4","v":3.7273260740034395}]
[{"$f":"DataTree!$D$3*ItemID1!$A$5+DataTree!$D$4*ItemID2!$A$5","v":4.9937011984265496}]
[{"$f":"DataTree!$D$3*ItemID1!$A$6+DataTree!$D$4*ItemID2!$A$6","v":4.4120231986417089}]
[{"$f":"DataTree!$D$3*ItemID1!$A$7+DataTree!$D$4*ItemID2!$A$7","v":3.8608044655060723}]
[{"$f":"DataTree!$D$3*ItemID1!$A$8+DataTree!$D$4*ItemID2!$A$8","v":3.653967281148808}]
{"$rows_left_out":93}
{"sheet":"ItemID1","index":11,"n_rows":100,"n_cols":1,"rows_kept":100,"cut":false,"hidden":false,"merged":[]}
[{"$f":"DataTree!$D$5*ItemID3!$A$1+DataTree!$D$6*ItemID4!$A$1","v":6.9167844948726724}]
[{"$f":"DataTree!$D$5*ItemID3!$A$2+DataTree!$D$6*ItemID4!$A$2","v":6.2126969097740741}]
[{"$f":"DataTree!$D$5*ItemID3!$A$3+DataTree!$D$6*ItemID4!$A$3","v":6.3001934278114149}]
[{"$f":"DataTree!$D$5*ItemID3!$A$4+DataTree!$D$6*ItemID4!$A$4","v":5.9064406079890537}]
[{"$f":"DataTree!$D$5*ItemID3!$A$5+DataTree!$D$6*ItemID4!$A$5","v":7.3712775056426505}]
[{"$f":"DataTree!$D$5*ItemID3!$A$6+DataTree!$D$6*ItemID4!$A$6","v":6.6984410133542145}]
[{"$f":"DataTree!$D$5*ItemID3!$A$7+DataTree!$D$6*ItemID4!$A$7","v":6.0608372548764269}]
[{"$f":"DataTree!$D$5*ItemID3!$A$8+DataTree!$D$6*ItemID4!$A$8","v":5.821585287896009}]
{"$rows_left_out":93}
{"sheet":"ItemID2","index":12,"n_rows":100,"n_cols":1,"rows_kept":100,"cut":false,"hidden":false,"merged":[]}
[{"$f":"DataTree!$D$7*ItemID5!$A$1+DataTree!$D$8*ItemID6!$A$1","v":3.6082133023166714}]
[{"$f":"DataTree!$D$7*ItemID5!$A$2+DataTree!$D$8*ItemID6!$A$2","v":3.0404007336887697}]
[{"$f":"DataTree!$D$7*ItemID5!$A$3+DataTree!$D$8*ItemID6!$A$3","v":3.110962441783399}]
[{"$f":"DataTree!$D$7*ItemID5!$A$4+DataTree!$D$8*ItemID6!$A$4","v":2.7934198451524628}]
[{"$f":"DataTree!$D$7*ItemID5!$A$5+DataTree!$D$8*ItemID6!$A$5","v":3.9747399239053633}]
[{"$f":"DataTree!$D$7*ItemID5!$A$6+DataTree!$D$8*ItemID6!$A$6","v":3.4321298494792063}]
[{"$f":"DataTree!$D$7*ItemID5!$A$7+DataTree!$D$8*ItemID6!$A$7","v":2.9179332700616349}]
[{"$f":"DataTree!$D$7*ItemID5!$A$8+DataTree!$D$8*ItemID6!$A$8","v":2.7249881354000074}]
{"$rows_left_out":93}
{"sheet":"ItemID3","index":13,"n_rows":100,"n_cols":1,"rows_kept":100,"cut":false,"hidden":false,"merged":[]}
[{"$f":"getrandprev(1, DataTree!$E$5,DataTree!$F$5,DataTree!$P$5,DataTree!$Q$5)","v":4.4517839441700087}]
[{"$f":"getrandprev(2, DataTree!$E$5,DataTree!$F$5,DataTree!$P$5,DataTree!$Q$5)","v":3.4297213206397856}]
[{"$f":"getrandprev(3, DataTree!$E$5,DataTree!$F$5,DataTree!$P$5,DataTree!$Q$5)","v":3.5567323952101186}]
[{"$f":"getrandprev(4, DataTree!$E$5,DataTree!$F$5,DataTree!$P$5,DataTree!$Q$5)","v":2.9851557212744328}]
[{"$f":"getrandprev(5, DataTree!$E$5,DataTree!$F$5,DataTree!$P$5,DataTree!$Q$5)","v":5.1115318630296542}]
[{"$f":"getrandprev(6, DataTree!$E$5,DataTree!$F$5,DataTree!$P$5,DataTree!$Q$5)","v":4.1348337290625707}]
[{"$f":"getrandprev(7, DataTree!$E$5,DataTree!$F$5,DataTree!$P$5,DataTree!$Q$5)","v":3.2092798861109433}]
[{"$f":"getrandprev(8, DataTree!$E$5,DataTree!$F$5,DataTree!$P$5,DataTree!$Q$5)","v":2.861978643720013}]
{"$rows_left_out":93}
{"sheet":"ItemID4","index":14,"n_rows":100,"n_cols":1,"rows_kept":100,"cut":false,"hidden":false,"merged":[]}
[{"$f":"getrandprev(1, DataTree!$E$6,DataTree!$F$6,DataTree!$P$6,DataTree!$Q$6)","v":7.9732133023166716}]
[{"$f":"getrandprev(2, DataTree!$E$6,DataTree!$F$6,DataTree!$P$6,DataTree!$Q$6)","v":7.4054007336887695}]
[{"$f":"getrandprev(3, DataTree!$E$6,DataTree!$F$6,DataTree!$P$6,DataTree!$Q$6)","v":7.4759624417833992}]
[{"$f":"getrandprev(4, DataTree!$E$6,DataTree!$F$6,DataTree!$P$6,DataTree!$Q$6)","v":7.158419845152463}]
[{"$f":"getrandprev(5, DataTree!$E$6,DataTree!$F$6,DataTree!$P$6,DataTree!$Q$6)","v":8.3397399239053627}]
[{"$f":"getrandprev(6, DataTree!$E$6,DataTree!$F$6,DataTree!$P$6,DataTree!$Q$6)","v":7.7971298494792061}]
[{"$f":"getrandprev(7, DataTree!$E$6,DataTree!$F$6,DataTree!$P$6,DataTree!$Q$6)","v":7.2829332700616352}]
[{"$f":"getrandprev(8, DataTree!$E$6,DataTree!$F$6,DataTree!$P$6,DataTree!$Q$6)","v":7.0899881354000067}]
{"$rows_left_out":93}
{"sheet":"ItemID5","index":15,"n_rows":100,"n_cols":1,"rows_kept":100,"cut":false,"hidden":false,"merged":[]}
[{"$f":"getrandprev(1, DataTree!$E$7,DataTree!$F$7,DataTree!$P$7,DataTree!$Q$7)","v":4.2039279813900023}]
[{"$f":"getrandprev(2, DataTree!$E$7,DataTree!$F$7,DataTree!$P$7,DataTree!$Q$7)","v":3.8632404402132616}]
[{"$f":"getrandprev(3, DataTree!$E$7,DataTree!$F$7,DataTree!$P$7,DataTree!$Q$7)","v":3.9055774650700394}]
[{"$f":"getrandprev(4, DataTree!$E$7,DataTree!$F$7,DataTree!$P$7,DataTree!$Q$7)","v":3.7150519070914774}]
[{"$f":"getrandprev(5, DataTree!$E$7,DataTree!$F$7,DataTree!$P$7,DataTree!$Q$7)","v":4.4238439543432175}]
[{"$f":"getrandprev(6, DataTree!$E$7,DataTree!$F$7,DataTree!$P$7,DataTree!$Q$7)","v":4.0982779096875239}]
[{"$f":"getrandprev(7, DataTree!$E$7,DataTree!$F$7,DataTree!$P$7,DataTree!$Q$7)","v":3.7897599620369808}]
[{"$f":"getrandprev(8, DataTree!$E$7,DataTree!$F$7,DataTree!$P$7,DataTree!$Q$7)","v":3.6739928812400042}]
{"$rows_left_out":93}
{"sheet":"ItemID6","index":16,"n_rows":100,"n_cols":1,"rows_kept":100,"cut":false,"hidden":false,"merged":[]}
[{"$f":"getrandprev(1, DataTree!$E$8,DataTree!$F$8,DataTree!$P$8,DataTree!$Q$8)","v":3.0124986232433399}]
[{"$f":"getrandprev(2, DataTree!$E$8,DataTree!$F$8,DataTree!$P$8,DataTree!$Q$8)","v":2.2175610271642778}]
[{"$f":"getrandprev(3, DataTree!$E$8,DataTree!$F$8,DataTree!$P$8,DataTree!$Q$8)","v":2.316347418496759}]
[{"$f":"getrandprev(4, DataTree!$E$8,DataTree!$F$8,DataTree!$P$8,DataTree!$Q$8)","v":1.8717877832134477}]
[{"$f":"getrandprev(5, DataTree!$E$8,DataTree!$F$8,DataTree!$P$8,DataTree!$Q$8)","v":3.5256358934675092}]
[{"$f":"getrandprev(6, DataTree!$E$8,DataTree!$F$8,DataTree!$P$8,DataTree!$Q$8)","v":2.7659817892708887}]
[{"$f":"getrandprev(7, DataTree!$E$8,DataTree!$F$8,DataTree!$P$8,DataTree!$Q$8)","v":2.0461065780862895}]
[{"$f":"getrandprev(8, DataTree!$E$8,DataTree!$F$8,DataTree!$P$8,DataTree!$Q$8)","v":1.7759833895600101}]
{"$rows_left_out":93}
{"sheet":"DemoArchiv","index":17,"n_rows":317,"n_cols":14,"rows_kept":317,"cut":false,"hidden":false,"merged":[]}
["Version :",0,"Count :",13]
["Project begin",7]
[0,0,-1,null,null,null,"Most SO 201 - beton",null,"Most Suchdol - beton"]
[1,1,0,0.3,0,0,"Technické řešení"]
[1,2,0,0.7,0,0,"Ekonomické řešení"]
[2,3,1,0.3,3.6,0.9,"Doba výstavby"]
[2,4,1,0.7,7.5,0.5,"Životnost"]
[2,5,2,0.5,3.92,0.3,"Pořizovací cena"]
{"$rows_left_out":310}
{"sheet":"Graph2D","index":18,"n_rows":11,"n_cols":2,"rows_kept":11,"cut":false,"hidden":false,"merged":[]}
[null,"Most SO 201 - beton"]
[3.1337057117162699,1]
[3.3204439935923862,1]
[3.5071822754685025,2]
[3.6939205573446192,11]
[3.8806588392207355,23]
[4.0673971210968523,47]
[4.2541354029729685,71]
{"$rows_left_out":4}
{"sheet":"SchemeTree","index":19,"n_rows":0,"n_cols":0,"rows_kept":0,"cut":false,"hidden":false,"merged":[]}

{"sheet":"Document","index":20,"n_rows":0,"n_cols":0,"rows_kept":0,"cut":false,"hidden":false,"merged":[]}

{"sheet":"ReportResult","index":21,"n_rows":179,"n_cols":15,"rows_kept":179,"cut":false,"hidden":false,"merged":[]}
[]
[]
["Název :","Most SO 201 - beton","Technické řešení","Ekonomické řešení","Doba výstavby","Životnost","Pořizovací cena","Provozní náklady /rok"]
["Popis :"]
["Významnost :",null,0.3,0.7,0.3,0.7,0.5,0.5]
["Hodnocení :",null,0,0,3.6,7.5,3.92,2.35]
["Riziko :",null,0,0,0.9,0.5,0.3,0.7]
["Hladina :",0,1,1,2,2,2,2]
{"$rows_left_out":172}
{"sheet":"Output","index":22,"n_rows":3,"n_cols":11,"rows_kept":3,"cut":false,"hidden":false,"merged":[]}
[null,null,null,null,null,null,null,null,0,1,1]
[null,null,null,null,null,null,null,null,1,2,2]
[null,null,null,null,null,null,null,null,2,4,4]

{"sheet":"OutputItem","index":23,"n_rows":0,"n_cols":0,"rows_kept":0,"cut":false,"hidden":false,"merged":[]}

{"sheet":"Transl","index":24,"n_rows":13,"n_cols":2,"rows_kept":13,"cut":false,"hidden":false,"merged":[]}
["Realizace","Realisation"]
["Čas","Time"]
["Hodnocení","Evaluation"]
["Trend položky: ","Trend of: "]
["Název : ","Title : "]
["(trend ","(trend "]
["(trend nezadáván) ","(trend not inputted) "]
["poč. období ","No. of period "]
{"$rows_left_out":5}